{"text_format":"1","workbook":"xlsx","n_sheets":4,"sheets":["Registration","Aufgebot","SR-DB","Settings"],"not_rendered":{"charts":0,"images":7,"macros":1,"external_links":0,"defined_names":4,"comments":0,"pivot_tables":0},"unopened":[],"bounds":{"document_bytes":16777216,"sheet_cells":100000,"rows_first":2000,"rows_last":500,"rows_between":2000,"halvings":0,"cell_chars":16384,"cell_head_chars":4096},"cells_cut":0,"cells_raw":0,"read":"whole","date_system":"1900"}

{"sheet":"Registration","index":0,"n_rows":205,"n_cols":11,"rows_kept":205,"cut":false,"hidden":false,"merged":[[0,0,0,2],[204,0,204,8],[1,4,3,4]]}
["SFV R.A.D.A.R.\nReferee Attendance - Digital Access & Registration",null,null,null,null,null,null,null,null,null,"FVRZ"]
["Anlass:","OLA 2025-1",null,null,{"$f":"_xlfn.XLOOKUP(K1,Settings!A:A,Settings!C:C,\"NA\",0)","v":{"$error":"#VALUE!"}},null,null,null,null,null,"Verbandsauswahl"]
["Datum:","2025-03-13"]
["Ort:","Thalwil",{"$f":"SUM(--(COUNTIF(A7:A204,_xlfn.UNIQUE(A7:A204))>1))","v":0}]
["Anwesende:",{"$f":"COUNTA(A7:A204) - C4 & \" (\" & COUNTIF(D7:D204,FALSE) & \" ohne Aufgebot)\"","v":"0 (0 ohne Aufgebot)"},{"$f":"IF(C4>0,C4 & \" Dublette(n) vorhanden!\",\"\")","v":""},null,"© 2025 Alain A. Asik"]
["SR-Nr","Vorname","Nachname","Im Aufgebot","Zeitstempel","Extrafeld 1","Extrafeld 2","Extrafeld 3","Extrafeld 4"]
[null,{"$f":"IF(ISBLANK($A7),\"\",_xlfn.XLOOKUP($A7,'SR-DB'!$C:$C,'SR-DB'!A:A,\"NA\",0))","v":""},{"$f":"IF(ISBLANK($A7),\"\",_xlfn.XLOOKUP($A7,'SR-DB'!$C:$C,'SR-DB'!B:B,\"NA\",0))","v":""},{"$f":"IF(ISBLANK(Tabelle1[[#This Row],[SR-Nr]]),\"\",IF(COUNTIF(Aufgebot!$A$7:$A$1000,Tabelle1[[#This Row],[SR-Nr]])>0,TRUE,FALSE))","v":""}]
[null,{"$f":"IF(ISBLANK($A8),\"\",_xlfn.XLOOKUP($A8,'SR-DB'!$C:$C,'SR-DB'!A:A,\"NA\",0))","v":""},{"$f":"IF(ISBLANK($A8),\"\",_xlfn.XLOOKUP($A8,'SR-DB'!$C:$C,'SR-DB'!B:B,\"NA\",0))","v":""},{"$f":"IF(ISBLANK(Tabelle1[[#This Row],[SR-Nr]]),\"\",IF(COUNTIF(Aufgebot!$A$7:$A$1000,Tabelle1[[#This Row],[SR-Nr]])>0,TRUE,FALSE))","v":""}]
[null,{"$f":"IF(ISBLANK($A9),\"\",_xlfn.XLOOKUP($A9,'SR-DB'!$C:$C,'SR-DB'!A:A,\"NA\",0))","v":""},{"$f":"IF(ISBLANK($A9),\"\",_xlfn.XLOOKUP($A9,'SR-DB'!$C:$C,'SR-DB'!B:B,\"NA\",0))","v":""},{"$f":"IF(ISBLANK(Tabelle1[[#This Row],[SR-Nr]]),\"\",IF(COUNTIF(Aufgebot!$A$7:$A$1000,Tabelle1[[#This Row],[SR-Nr]])>0,TRUE,FALSE))","v":""}]
[null,{"$f":"IF(ISBLANK($A10),\"\",_xlfn.XLOOKUP($A10,'SR-DB'!$C:$C,'SR-DB'!A:A,\"NA\",0))","v":""},{"$f":"IF(ISBLANK($A10),\"\",_xlfn.XLOOKUP($A10,'SR-DB'!$C:$C,'SR-DB'!B:B,\"NA\",0))","v":""},{"$f":"IF(ISBLANK(Tabelle1[[#This Row],[SR-Nr]]),\"\",IF(COUNTIF(Aufgebot!$A$7:$A$1000,Tabelle1[[#This Row],[SR-Nr]])>0,TRUE,FALSE))","v":""}]
[null,{"$f":"IF(ISBLANK($A11),\"\",_xlfn.XLOOKUP($A11,'SR-DB'!$C:$C,'SR-DB'!A:A,\"NA\",0))","v":""},{"$f":"IF(ISBLANK($A11),\"\",_xlfn.XLOOKUP($A11,'SR-DB'!$C:$C,'SR-DB'!B:B,\"NA\",0))","v":""},{"$f":"IF(ISBLANK(Tabelle1[[#This Row],[SR-Nr]]),\"\",IF(COUNTIF(Aufgebot!$A$7:$A$1000,Tabelle1[[#This Row],[SR-Nr]])>0,TRUE,FALSE))","v":""}]
[null,{"$f":"IF(ISBLANK($A12),\"\",_xlfn.XLOOKUP($A12,'SR-DB'!$C:$C,'SR-DB'!A:A,\"NA\",0))","v":""},{"$f":"IF(ISBLANK($A12),\"\",_xlfn.XLOOKUP($A12,'SR-DB'!$C:$C,'SR-DB'!B:B,\"NA\",0))","v":""},{"$f":"IF(ISBLANK(Tabelle1[[#This Row],[SR-Nr]]),\"\",IF(COUNTIF(Aufgebot!$A$7:$A$1000,Tabelle1[[#This Row],[SR-Nr]])>0,TRUE,FALSE))","v":""}]
[null,{"$f":"IF(ISBLANK($A13),\"\",_xlfn.XLOOKUP($A13,'SR-DB'!$C:$C,'SR-DB'!A:A,\"NA\",0))","v":""},{"$f":"IF(ISBLANK($A13),\"\",_xlfn.XLOOKUP($A13,'SR-DB'!$C:$C,'SR-DB'!B:B,\"NA\",0))","v":""},{"$f":"IF(ISBLANK(Tabelle1[[#This Row],[SR-Nr]]),\"\",IF(COUNTIF(Aufgebot!$A$7:$A$1000,Tabelle1[[#This Row],[SR-Nr]])>0,TRUE,FALSE))","v":""}]
[null,{"$f":"IF(ISBLANK($A14),\"\",_xlfn.XLOOKUP($A14,'SR-DB'!$C:$C,'SR-DB'!A:A,\"NA\",0))","v":""},{"$f":"IF(ISBLANK($A14),\"\",_xlfn.XLOOKUP($A14,'SR-DB'!$C:$C,'SR-DB'!B:B,\"NA\",0))","v":""},{"$f":"IF(ISBLANK(Tabelle1[[#This Row],[SR-Nr]]),\"\",IF(COUNTIF(Aufgebot!$A$7:$A$1000,Tabelle1[[#This Row],[SR-Nr]])>0,TRUE,FALSE))","v":""}]
[null,{"$f":"IF(ISBLANK($A15),\"\",_xlfn.XLOOKUP($A15,'SR-DB'!$C:$C,'SR-DB'!A:A,\"NA\",0))","v":""},{"$f":"IF(ISBLANK($A15),\"\",_xlfn.XLOOKUP($A15,'SR-DB'!$C:$C,'SR-DB'!B:B,\"NA\",0))","v":""},{"$f":"IF(ISBLANK(Tabelle1[[#This Row],[SR-Nr]]),\"\",IF(COUNTIF(Aufgebot!$A$7:$A$1000,Tabelle1[[#This Row],[SR-Nr]])>0,TRUE,FALSE))","v":""}]
[null,{"$f":"IF(ISBLANK($A16),\"\",_xlfn.XLOOKUP($A16,'SR-DB'!$C:$C,'SR-DB'!A:A,\"NA\",0))","v":""},{"$f":"IF(ISBLANK($A16),\"\",_xlfn.XLOOKUP($A16,'SR-DB'!$C:$C,'SR-DB'!B:B,\"NA\",0))","v":""},{"$f":"IF(ISBLANK(Tabelle1[[#This Row],[SR-Nr]]),\"\",IF(COUNTIF(Aufgebot!$A$7:$A$1000,Tabelle1[[#This Row],[SR-Nr]])>0,TRUE,FALSE))","v":""}]
[null,{"$f":"IF(ISBLANK($A17),\"\",_xlfn.XLOOKUP($A17,'SR-DB'!$C:$C,'SR-DB'!A:A,\"NA\",0))","v":""},{"$f":"IF(ISBLANK($A17),\"\",_xlfn.XLOOKUP($A17,'SR-DB'!$C:$C,'SR-DB'!B:B,\"NA\",0))","v":""},{"$f":"IF(ISBLANK(Tabelle1[[#This Row],[SR-Nr]]),\"\",IF(COUNTIF(Aufgebot!$A$7:$A$1000,Tabelle1[[#This Row],[SR-Nr]])>0,TRUE,FALSE))","v":""}]
[null,{"$f":"IF(ISBLANK($A18),\"\",_xlfn.XLOOKUP($A18,'SR-DB'!$C:$C,'SR-DB'!A:A,\"NA\",0))","v":""},{"$f":"IF(ISBLANK($A18),\"\",_xlfn.XLOOKUP($A18,'SR-DB'!$C:$C,'SR-DB'!B:B,\"NA\",0))","v":""},{"$f":"IF(ISBLANK(Tabelle1[[#This Row],[SR-Nr]]),\"\",IF(COUNTIF(Aufgebot!$A$7:$A$1000,Tabelle1[[#This Row],[SR-Nr]])>0,TRUE,FALSE))","v":""}]
[null,{"$f":"IF(ISBLANK($A19),\"\",_xlfn.XLOOKUP($A19,'SR-DB'!$C:$C,'SR-DB'!A:A,\"NA\",0))","v":""},{"$f":"IF(ISBLANK($A19),\"\",_xlfn.XLOOKUP($A19,'SR-DB'!$C:$C,'SR-DB'!B:B,\"NA\",0))","v":""},{"$f":"IF(ISBLANK(Tabelle1[[#This Row],[SR-Nr]]),\"\",IF(COUNTIF(Aufgebot!$A$7:$A$1000,Tabelle1[[#This Row],[SR-Nr]])>0,TRUE,FALSE))","v":""}]
[null,{"$f":"IF(ISBLANK($A20),\"\",_xlfn.XLOOKUP($A20,'SR-DB'!$C:$C,'SR-DB'!A:A,\"NA\",0))","v":""},{"$f":"IF(ISBLANK($A20),\"\",_xlfn.XLOOKUP($A20,'SR-DB'!$C:$C,'SR-DB'!B:B,\"NA\",0))","v":""},{"$f":"IF(ISBLANK(Tabelle1[[#This Row],[SR-Nr]]),\"\",IF(COUNTIF(Aufgebot!$A$7:$A$1000,Tabelle1[[#This Row],[SR-Nr]])>0,TRUE,FALSE))","v":""}]
[null,{"$f":"IF(ISBLANK($A21),\"\",_xlfn.XLOOKUP($A21,'SR-DB'!$C:$C,'SR-DB'!A:A,\"NA\",0))","v":""},{"$f":"IF(ISBLANK($A21),\"\",_xlfn.XLOOKUP($A21,'SR-DB'!$C:$C,'SR-DB'!B:B,\"NA\",0))","v":""},{"$f":"IF(ISBLANK(Tabelle1[[#This Row],[SR-Nr]]),\"\",IF(COUNTIF(Aufgebot!$A$7:$A$1000,Tabelle1[[#This Row],[SR-Nr]])>0,TRUE,FALSE))","v":""}]
[null,{"$f":"IF(ISBLANK($A22),\"\",_xlfn.XLOOKUP($A22,'SR-DB'!$C:$C,'SR-DB'!A:A,\"NA\",0))","v":""},{"$f":"IF(ISBLANK($A22),\"\",_xlfn.XLOOKUP($A22,'SR-DB'!$C:$C,'SR-DB'!B:B,\"NA\",0))","v":""},{"$f":"IF(ISBLANK(Tabelle1[[#This Row],[SR-Nr]]),\"\",IF(COUNTIF(Aufgebot!$A$7:$A$1000,Tabelle1[[#This Row],[SR-Nr]])>0,TRUE,FALSE))","v":""}]
[null,{"$f":"IF(ISBLANK($A23),\"\",_xlfn.XLOOKUP($A23,'SR-DB'!$C:$C,'SR-DB'!A:A,\"NA\",0))","v":""},{"$f":"IF(ISBLANK($A23),\"\",_xlfn.XLOOKUP($A23,'SR-DB'!$C:$C,'SR-DB'!B:B,\"NA\",0))","v":""},{"$f":"IF(ISBLANK(Tabelle1[[#This Row],[SR-Nr]]),\"\",IF(COUNTIF(Aufgebot!$A$7:$A$1000,Tabelle1[[#This Row],[SR-Nr]])>0,TRUE,FALSE))","v":""}]
[null,{"$f":"IF(ISBLANK($A24),\"\",_xlfn.XLOOKUP($A24,'SR-DB'!$C:$C,'SR-DB'!A:A,\"NA\",0))","v":""},{"$f":"IF(ISBLANK($A24),\"\",_xlfn.XLOOKUP($A24,'SR-DB'!$C:$C,'SR-DB'!B:B,\"NA\",0))","v":""},{"$f":"IF(ISBLANK(Tabelle1[[#This Row],[SR-Nr]]),\"\",IF(COUNTIF(Aufgebot!$A$7:$A$1000,Tabelle1[[#This Row],[SR-Nr]])>0,TRUE,FALSE))","v":""}]
[null,{"$f":"IF(ISBLANK($A25),\"\",_xlfn.XLOOKUP($A25,'SR-DB'!$C:$C,'SR-DB'!A:A,\"NA\",0))","v":""},{"$f":"IF(ISBLANK($A25),\"\",_xlfn.XLOOKUP($A25,'SR-DB'!$C:$C,'SR-DB'!B:B,\"NA\",0))","v":""},{"$f":"IF(ISBLANK(Tabelle1[[#This Row],[SR-Nr]]),\"\",IF(COUNTIF(Aufgebot!$A$7:$A$1000,Tabelle1[[#This Row],[SR-Nr]])>0,TRUE,FALSE))","v":""}]
[null,{"$f":"IF(ISBLANK($A26),\"\",_xlfn.XLOOKUP($A26,'SR-DB'!$C:$C,'SR-DB'!A:A,\"NA\",0))","v":""},{"$f":"IF(ISBLANK($A26),\"\",_xlfn.XLOOKUP($A26,'SR-DB'!$C:$C,'SR-DB'!B:B,\"NA\",0))","v":""},{"$f":"IF(ISBLANK(Tabelle1[[#This Row],[SR-Nr]]),\"\",IF(COUNTIF(Aufgebot!$A$7:$A$1000,Tabelle1[[#This Row],[SR-Nr]])>0,TRUE,FALSE))","v":""}]
[null,{"$f":"IF(ISBLANK($A27),\"\",_xlfn.XLOOKUP($A27,'SR-DB'!$C:$C,'SR-DB'!A:A,\"NA\",0))","v":""},{"$f":"IF(ISBLANK($A27),\"\",_xlfn.XLOOKUP($A27,'SR-DB'!$C:$C,'SR-DB'!B:B,\"NA\",0))","v":""},{"$f":"IF(ISBLANK(Tabelle1[[#This Row],[SR-Nr]]),\"\",IF(COUNTIF(Aufgebot!$A$7:$A$1000,Tabelle1[[#This Row],[SR-Nr]])>0,TRUE,FALSE))","v":""}]
[null,{"$f":"IF(ISBLANK($A28),\"\",_xlfn.XLOOKUP($A28,'SR-DB'!$C:$C,'SR-DB'!A:A,\"NA\",0))","v":""},{"$f":"IF(ISBLANK($A28),\"\",_xlfn.XLOOKUP($A28,'SR-DB'!$C:$C,'SR-DB'!B:B,\"NA\",0))","v":""},{"$f":"IF(ISBLANK(Tabelle1[[#This Row],[SR-Nr]]),\"\",IF(COUNTIF(Aufgebot!$A$7:$A$1000,Tabelle1[[#This Row],[SR-Nr]])>0,TRUE,FALSE))","v":""}]
[null,{"$f":"IF(ISBLANK($A29),\"\",_xlfn.XLOOKUP($A29,'SR-DB'!$C:$C,'SR-DB'!A:A,\"NA\",0))","v":""},{"$f":"IF(ISBLANK($A29),\"\",_xlfn.XLOOKUP($A29,'SR-DB'!$C:$C,'SR-DB'!B:B,\"NA\",0))","v":""},{"$f":"IF(ISBLANK(Tabelle1[[#This Row],[SR-Nr]]),\"\",IF(COUNTIF(Aufgebot!$A$7:$A$1000,Tabelle1[[#This Row],[SR-Nr]])>0,TRUE,FALSE))","v":""}]
[null,{"$f":"IF(ISBLANK($A30),\"\",_xlfn.XLOOKUP($A30,'SR-DB'!$C:$C,'SR-DB'!A:A,\"NA\",0))","v":""},{"$f":"IF(ISBLANK($A30),\"\",_xlfn.XLOOKUP($A30,'SR-DB'!$C:$C,'SR-DB'!B:B,\"NA\",0))","v":""},{"$f":"IF(ISBLANK(Tabelle1[[#This Row],[SR-Nr]]),\"\",IF(COUNTIF(Aufgebot!$A$7:$A$1000,Tabelle1[[#This Row],[SR-Nr]])>0,TRUE,FALSE))","v":""}]
{"$rows_left_out":176}
{"sheet":"Aufgebot","index":1,"n_rows":1003,"n_cols":4,"rows_kept":1003,"cut":false,"hidden":false,"merged":[[0,0,0,1],[1002,0,1002,3]]}
["Aufgebot"]
["Stand:","2025-03-15"]
["Aufgebotene:",{"$f":"COUNT(A7:A1002)","v":0}]
["Anwesende*:",{"$f":"COUNTIF(D7:D1000,TRUE)","v":0}]
["Abwesende:",{"$f":"B3-B4","v":0},null,"*gem. Aufgebot"]
["SR-Nr","Vorname","Nachname","Anwesend"]
[null,{"$f":"IF(ISBLANK(SRDB4[[#This Row],[SR-Nr]]),\"\",_xlfn.XLOOKUP(SRDB4[[#This Row],[SR-Nr]],SRDB[SR-Nr.],SRDB[Vorname],\"NA\",0))","v":""},{"$f":"IF(ISBLANK(SRDB4[[#This Row],[SR-Nr]]),\"\",_xlfn.XLOOKUP(SRDB4[[#This Row],[SR-Nr]],SRDB[SR-Nr.],SRDB[Name],\"NA\",0))","v":""},{"$f":"IF(ISBLANK(SRDB4[[#This Row],[SR-Nr]]),\"\",IF(COUNTIF(Registration!$A$7:$A$204,SRDB4[[#This Row],[SR-Nr]])=1,TRUE,FALSE))","v":""}]
[null,{"$f":"IF(ISBLANK(SRDB4[[#This Row],[SR-Nr]]),\"\",_xlfn.XLOOKUP(SRDB4[[#This Row],[SR-Nr]],SRDB[SR-Nr.],SRDB[Vorname],\"NA\",0))","v":""},{"$f":"IF(ISBLANK(SRDB4[[#This Row],[SR-Nr]]),\"\",_xlfn.XLOOKUP(SRDB4[[#This Row],[SR-Nr]],SRDB[SR-Nr.],SRDB[Name],\"NA\",0))","v":""},{"$f":"IF(ISBLANK(SRDB4[[#This Row],[SR-Nr]]),\"\",IF(COUNTIF(Registration!$A$7:$A$204,SRDB4[[#This Row],[SR-Nr]])=1,TRUE,FALSE))","v":""}]
[null,{"$f":"IF(ISBLANK(SRDB4[[#This Row],[SR-Nr]]),\"\",_xlfn.XLOOKUP(SRDB4[[#This Row],[SR-Nr]],SRDB[SR-Nr.],SRDB[Vorname],\"NA\",0))","v":""},{"$f":"IF(ISBLANK(SRDB4[[#This Row],[SR-Nr]]),\"\",_xlfn.XLOOKUP(SRDB4[[#This Row],[SR-Nr]],SRDB[SR-Nr.],SRDB[Name],\"NA\",0))","v":""},{"$f":"IF(ISBLANK(SRDB4[[#This Row],[SR-Nr]]),\"\",IF(COUNTIF(Registration!$A$7:$A$204,SRDB4[[#This Row],[SR-Nr]])=1,TRUE,FALSE))","v":""}]
[null,{"$f":"IF(ISBLANK(SRDB4[[#This Row],[SR-Nr]]),\"\",_xlfn.XLOOKUP(SRDB4[[#This Row],[SR-Nr]],SRDB[SR-Nr.],SRDB[Vorname],\"NA\",0))","v":""},{"$f":"IF(ISBLANK(SRDB4[[#This Row],[SR-Nr]]),\"\",_xlfn.XLOOKUP(SRDB4[[#This Row],[SR-Nr]],SRDB[SR-Nr.],SRDB[Name],\"NA\",0))","v":""},{"$f":"IF(ISBLANK(SRDB4[[#This Row],[SR-Nr]]),\"\",IF(COUNTIF(Registration!$A$7:$A$204,SRDB4[[#This Row],[SR-Nr]])=1,TRUE,FALSE))","v":""}]
[null,{"$f":"IF(ISBLANK(SRDB4[[#This Row],[SR-Nr]]),\"\",_xlfn.XLOOKUP(SRDB4[[#This Row],[SR-Nr]],SRDB[SR-Nr.],SRDB[Vorname],\"NA\",0))","v":""},{"$f":"IF(ISBLANK(SRDB4[[#This Row],[SR-Nr]]),\"\",_xlfn.XLOOKUP(SRDB4[[#This Row],[SR-Nr]],SRDB[SR-Nr.],SRDB[Name],\"NA\",0))","v":""},{"$f":"IF(ISBLANK(SRDB4[[#This Row],[SR-Nr]]),\"\",IF(COUNTIF(Registration!$A$7:$A$204,SRDB4[[#This Row],[SR-Nr]])=1,TRUE,FALSE))","v":""}]
[null,{"$f":"IF(ISBLANK(SRDB4[[#This Row],[SR-Nr]]),\"\",_xlfn.XLOOKUP(SRDB4[[#This Row],[SR-Nr]],SRDB[SR-Nr.],SRDB[Vorname],\"NA\",0))","v":""},{"$f":"IF(ISBLANK(SRDB4[[#This Row],[SR-Nr]]),\"\",_xlfn.XLOOKUP(SRDB4[[#This Row],[SR-Nr]],SRDB[SR-Nr.],SRDB[Name],\"NA\",0))","v":""},{"$f":"IF(ISBLANK(SRDB4[[#This Row],[SR-Nr]]),\"\",IF(COUNTIF(Registration!$A$7:$A$204,SRDB4[[#This Row],[SR-Nr]])=1,TRUE,FALSE))","v":""}]
[null,{"$f":"IF(ISBLANK(SRDB4[[#This Row],[SR-Nr]]),\"\",_xlfn.XLOOKUP(SRDB4[[#This Row],[SR-Nr]],SRDB[SR-Nr.],SRDB[Vorname],\"NA\",0))","v":""},{"$f":"IF(ISBLANK(SRDB4[[#This Row],[SR-Nr]]),\"\",_xlfn.XLOOKUP(SRDB4[[#This Row],[SR-Nr]],SRDB[SR-Nr.],SRDB[Name],\"NA\",0))","v":""},{"$f":"IF(ISBLANK(SRDB4[[#This Row],[SR-Nr]]),\"\",IF(COUNTIF(Registration!$A$7:$A$204,SRDB4[[#This Row],[SR-Nr]])=1,TRUE,FALSE))","v":""}]
[null,{"$f":"IF(ISBLANK(SRDB4[[#This Row],[SR-Nr]]),\"\",_xlfn.XLOOKUP(SRDB4[[#This Row],[SR-Nr]],SRDB[SR-Nr.],SRDB[Vorname],\"NA\",0))","v":""},{"$f":"IF(ISBLANK(SRDB4[[#This Row],[SR-Nr]]),\"\",_xlfn.XLOOKUP(SRDB4[[#This Row],[SR-Nr]],SRDB[SR-Nr.],SRDB[Name],\"NA\",0))","v":""},{"$f":"IF(ISBLANK(SRDB4[[#This Row],[SR-Nr]]),\"\",IF(COUNTIF(Registration!$A$7:$A$204,SRDB4[[#This Row],[SR-Nr]])=1,TRUE,FALSE))","v":""}]
[null,{"$f":"IF(ISBLANK(SRDB4[[#This Row],[SR-Nr]]),\"\",_xlfn.XLOOKUP(SRDB4[[#This Row],[SR-Nr]],SRDB[SR-Nr.],SRDB[Vorname],\"NA\",0))","v":""},{"$f":"IF(ISBLANK(SRDB4[[#This Row],[SR-Nr]]),\"\",_xlfn.XLOOKUP(SRDB4[[#This Row],[SR-Nr]],SRDB[SR-Nr.],SRDB[Name],\"NA\",0))","v":""},{"$f":"IF(ISBLANK(SRDB4[[#This Row],[SR-Nr]]),\"\",IF(COUNTIF(Registration!$A$7:$A$204,SRDB4[[#This Row],[SR-Nr]])=1,TRUE,FALSE))","v":""}]
[null,{"$f":"IF(ISBLANK(SRDB4[[#This Row],[SR-Nr]]),\"\",_xlfn.XLOOKUP(SRDB4[[#This Row],[SR-Nr]],SRDB[SR-Nr.],SRDB[Vorname],\"NA\",0))","v":""},{"$f":"IF(ISBLANK(SRDB4[[#This Row],[SR-Nr]]),\"\",_xlfn.XLOOKUP(SRDB4[[#This Row],[SR-Nr]],SRDB[SR-Nr.],SRDB[Name],\"NA\",0))","v":""},{"$f":"IF(ISBLANK(SRDB4[[#This Row],[SR-Nr]]),\"\",IF(COUNTIF(Registration!$A$7:$A$204,SRDB4[[#This Row],[SR-Nr]])=1,TRUE,FALSE))","v":""}]
[null,{"$f":"IF(ISBLANK(SRDB4[[#This Row],[SR-Nr]]),\"\",_xlfn.XLOOKUP(SRDB4[[#This Row],[SR-Nr]],SRDB[SR-Nr.],SRDB[Vorname],\"NA\",0))","v":""},{"$f":"IF(ISBLANK(SRDB4[[#This Row],[SR-Nr]]),\"\",_xlfn.XLOOKUP(SRDB4[[#This Row],[SR-Nr]],SRDB[SR-Nr.],SRDB[Name],\"NA\",0))","v":""},{"$f":"IF(ISBLANK(SRDB4[[#This Row],[SR-Nr]]),\"\",IF(COUNTIF(Registration!$A$7:$A$204,SRDB4[[#This Row],[SR-Nr]])=1,TRUE,FALSE))","v":""}]
[null,{"$f":"IF(ISBLANK(SRDB4[[#This Row],[SR-Nr]]),\"\",_xlfn.XLOOKUP(SRDB4[[#This Row],[SR-Nr]],SRDB[SR-Nr.],SRDB[Vorname],\"NA\",0))","v":""},{"$f":"IF(ISBLANK(SRDB4[[#This Row],[SR-Nr]]),\"\",_xlfn.XLOOKUP(SRDB4[[#This Row],[SR-Nr]],SRDB[SR-Nr.],SRDB[Name],\"NA\",0))","v":""},{"$f":"IF(ISBLANK(SRDB4[[#This Row],[SR-Nr]]),\"\",IF(COUNTIF(Registration!$A$7:$A$204,SRDB4[[#This Row],[SR-Nr]])=1,TRUE,FALSE))","v":""}]
[null,{"$f":"IF(ISBLANK(SRDB4[[#This Row],[SR-Nr]]),\"\",_xlfn.XLOOKUP(SRDB4[[#This Row],[SR-Nr]],SRDB[SR-Nr.],SRDB[Vorname],\"NA\",0))","v":""},{"$f":"IF(ISBLANK(SRDB4[[#This Row],[SR-Nr]]),\"\",_xlfn.XLOOKUP(SRDB4[[#This Row],[SR-Nr]],SRDB[SR-Nr.],SRDB[Name],\"NA\",0))","v":""},{"$f":"IF(ISBLANK(SRDB4[[#This Row],[SR-Nr]]),\"\",IF(COUNTIF(Registration!$A$7:$A$204,SRDB4[[#This Row],[SR-Nr]])=1,TRUE,FALSE))","v":""}]
[null,{"$f":"IF(ISBLANK(SRDB4[[#This Row],[SR-Nr]]),\"\",_xlfn.XLOOKUP(SRDB4[[#This Row],[SR-Nr]],SRDB[SR-Nr.],SRDB[Vorname],\"NA\",0))","v":""},{"$f":"IF(ISBLANK(SRDB4[[#This Row],[SR-Nr]]),\"\",_xlfn.XLOOKUP(SRDB4[[#This Row],[SR-Nr]],SRDB[SR-Nr.],SRDB[Name],\"NA\",0))","v":""},{"$f":"IF(ISBLANK(SRDB4[[#This Row],[SR-Nr]]),\"\",IF(COUNTIF(Registration!$A$7:$A$204,SRDB4[[#This Row],[SR-Nr]])=1,TRUE,FALSE))","v":""}]
[null,{"$f":"IF(ISBLANK(SRDB4[[#This Row],[SR-Nr]]),\"\",_xlfn.XLOOKUP(SRDB4[[#This Row],[SR-Nr]],SRDB[SR-Nr.],SRDB[Vorname],\"NA\",0))","v":""},{"$f":"IF(ISBLANK(SRDB4[[#This Row],[SR-Nr]]),\"\",_xlfn.XLOOKUP(SRDB4[[#This Row],[SR-Nr]],SRDB[SR-Nr.],SRDB[Name],\"NA\",0))","v":""},{"$f":"IF(ISBLANK(SRDB4[[#This Row],[SR-Nr]]),\"\",IF(COUNTIF(Registration!$A$7:$A$204,SRDB4[[#This Row],[SR-Nr]])=1,TRUE,FALSE))","v":""}]
[null,{"$f":"IF(ISBLANK(SRDB4[[#This Row],[SR-Nr]]),\"\",_xlfn.XLOOKUP(SRDB4[[#This Row],[SR-Nr]],SRDB[SR-Nr.],SRDB[Vorname],\"NA\",0))","v":""},{"$f":"IF(ISBLANK(SRDB4[[#This Row],[SR-Nr]]),\"\",_xlfn.XLOOKUP(SRDB4[[#This Row],[SR-Nr]],SRDB[SR-Nr.],SRDB[Name],\"NA\",0))","v":""},{"$f":"IF(ISBLANK(SRDB4[[#This Row],[SR-Nr]]),\"\",IF(COUNTIF(Registration!$A$7:$A$204,SRDB4[[#This Row],[SR-Nr]])=1,TRUE,FALSE))","v":""}]
[null,{"$f":"IF(ISBLANK(SRDB4[[#This Row],[SR-Nr]]),\"\",_xlfn.XLOOKUP(SRDB4[[#This Row],[SR-Nr]],SRDB[SR-Nr.],SRDB[Vorname],\"NA\",0))","v":""},{"$f":"IF(ISBLANK(SRDB4[[#This Row],[SR-Nr]]),\"\",_xlfn.XLOOKUP(SRDB4[[#This Row],[SR-Nr]],SRDB[SR-Nr.],SRDB[Name],\"NA\",0))","v":""},{"$f":"IF(ISBLANK(SRDB4[[#This Row],[SR-Nr]]),\"\",IF(COUNTIF(Registration!$A$7:$A$204,SRDB4[[#This Row],[SR-Nr]])=1,TRUE,FALSE))","v":""}]
[null,{"$f":"IF(ISBLANK(SRDB4[[#This Row],[SR-Nr]]),\"\",_xlfn.XLOOKUP(SRDB4[[#This Row],[SR-Nr]],SRDB[SR-Nr.],SRDB[Vorname],\"NA\",0))","v":""},{"$f":"IF(ISBLANK(SRDB4[[#This Row],[SR-Nr]]),\"\",_xlfn.XLOOKUP(SRDB4[[#This Row],[SR-Nr]],SRDB[SR-Nr.],SRDB[Name],\"NA\",0))","v":""},{"$f":"IF(ISBLANK(SRDB4[[#This Row],[SR-Nr]]),\"\",IF(COUNTIF(Registration!$A$7:$A$204,SRDB4[[#This Row],[SR-Nr]])=1,TRUE,FALSE))","v":""}]
[null,{"$f":"IF(ISBLANK(SRDB4[[#This Row],[SR-Nr]]),\"\",_xlfn.XLOOKUP(SRDB4[[#This Row],[SR-Nr]],SRDB[SR-Nr.],SRDB[Vorname],\"NA\",0))","v":""},{"$f":"IF(ISBLANK(SRDB4[[#This Row],[SR-Nr]]),\"\",_xlfn.XLOOKUP(SRDB4[[#This Row],[SR-Nr]],SRDB[SR-Nr.],SRDB[Name],\"NA\",0))","v":""},{"$f":"IF(ISBLANK(SRDB4[[#This Row],[SR-Nr]]),\"\",IF(COUNTIF(Registration!$A$7:$A$204,SRDB4[[#This Row],[SR-Nr]])=1,TRUE,FALSE))","v":""}]
[null,{"$f":"IF(ISBLANK(SRDB4[[#This Row],[SR-Nr]]),\"\",_xlfn.XLOOKUP(SRDB4[[#This Row],[SR-Nr]],SRDB[SR-Nr.],SRDB[Vorname],\"NA\",0))","v":""},{"$f":"IF(ISBLANK(SRDB4[[#This Row],[SR-Nr]]),\"\",_xlfn.XLOOKUP(SRDB4[[#This Row],[SR-Nr]],SRDB[SR-Nr.],SRDB[Name],\"NA\",0))","v":""},{"$f":"IF(ISBLANK(SRDB4[[#This Row],[SR-Nr]]),\"\",IF(COUNTIF(Registration!$A$7:$A$204,SRDB4[[#This Row],[SR-Nr]])=1,TRUE,FALSE))","v":""}]
[null,{"$f":"IF(ISBLANK(SRDB4[[#This Row],[SR-Nr]]),\"\",_xlfn.XLOOKUP(SRDB4[[#This Row],[SR-Nr]],SRDB[SR-Nr.],SRDB[Vorname],\"NA\",0))","v":""},{"$f":"IF(ISBLANK(SRDB4[[#This Row],[SR-Nr]]),\"\",_xlfn.XLOOKUP(SRDB4[[#This Row],[SR-Nr]],SRDB[SR-Nr.],SRDB[Name],\"NA\",0))","v":""},{"$f":"IF(ISBLANK(SRDB4[[#This Row],[SR-Nr]]),\"\",IF(COUNTIF(Registration!$A$7:$A$204,SRDB4[[#This Row],[SR-Nr]])=1,TRUE,FALSE))","v":""}]
[null,{"$f":"IF(ISBLANK(SRDB4[[#This Row],[SR-Nr]]),\"\",_xlfn.XLOOKUP(SRDB4[[#This Row],[SR-Nr]],SRDB[SR-Nr.],SRDB[Vorname],\"NA\",0))","v":""},{"$f":"IF(ISBLANK(SRDB4[[#This Row],[SR-Nr]]),\"\",_xlfn.XLOOKUP(SRDB4[[#This Row],[SR-Nr]],SRDB[SR-Nr.],SRDB[Name],\"NA\",0))","v":""},{"$f":"IF(ISBLANK(SRDB4[[#This Row],[SR-Nr]]),\"\",IF(COUNTIF(Registration!$A$7:$A$204,SRDB4[[#This Row],[SR-Nr]])=1,TRUE,FALSE))","v":""}]
[null,{"$f":"IF(ISBLANK(SRDB4[[#This Row],[SR-Nr]]),\"\",_xlfn.XLOOKUP(SRDB4[[#This Row],[SR-Nr]],SRDB[SR-Nr.],SRDB[Vorname],\"NA\",0))","v":""},{"$f":"IF(ISBLANK(SRDB4[[#This Row],[SR-Nr]]),\"\",_xlfn.XLOOKUP(SRDB4[[#This Row],[SR-Nr]],SRDB[SR-Nr.],SRDB[Name],\"NA\",0))","v":""},{"$f":"IF(ISBLANK(SRDB4[[#This Row],[SR-Nr]]),\"\",IF(COUNTIF(Registration!$A$7:$A$204,SRDB4[[#This Row],[SR-Nr]])=1,TRUE,FALSE))","v":""}]
[null,{"$f":"IF(ISBLANK(SRDB4[[#This Row],[SR-Nr]]),\"\",_xlfn.XLOOKUP(SRDB4[[#This Row],[SR-Nr]],SRDB[SR-Nr.],SRDB[Vorname],\"NA\",0))","v":""},{"$f":"IF(ISBLANK(SRDB4[[#This Row],[SR-Nr]]),\"\",_xlfn.XLOOKUP(SRDB4[[#This Row],[SR-Nr]],SRDB[SR-Nr.],SRDB[Name],\"NA\",0))","v":""},{"$f":"IF(ISBLANK(SRDB4[[#This Row],[SR-Nr]]),\"\",IF(COUNTIF(Registration!$A$7:$A$204,SRDB4[[#This Row],[SR-Nr]])=1,TRUE,FALSE))","v":""}]
{"$rows_left_out":974}
{"sheet":"SR-DB","index":2,"n_rows":1001,"n_cols":3,"rows_kept":1001,"cut":false,"hidden":false,"merged":[[0,0,0,1],[1000,0,1000,2]]}
["Schiedsrichterverzeichnis"]
["Stand:","2025-03-15"]
["Anzahl:",{"$f":"COUNT(C5:C1000)","v":2}]
["Vorname","Name","SR-Nr."]
["Max","Muster",123456]
["Alois","Arbiter",98765]
[]
[]
[]
[]
[]
[]
[]
[]
[]
[]
[]
[]
[]
[]
[]
[]
[]
[]
[]
[]
[]
[]
[]
[]
{"$rows_left_out":972}
{"sheet":"Settings","index":3,"n_rows":18,"n_cols":11,"rows_kept":18,"cut":false,"hidden":false,"merged":[]}
["Verband","E-Mail","Logo","HEX-Code","Sprache","Empfänger",null,"Element","Deutsch","Français","Italiano"]
["ACGF","test@football.ch",{"$error":"#VALUE!"},"d0002b",null,null,null,null,"Anlass:","Événement :","Evento :"]
["ACVF","test@football.ch",{"$error":"#VALUE!"},"d0002b",null,null,null,null,"Datum:","Date :","Data :"]
["AFF-FFV","test@football.ch",{"$error":"#VALUE!"},"d0002b",null,null,null,null,"Ort:","Lieu :","Luogo :"]
["AFV","test@football.ch",{"$error":"#VALUE!"},"23328c",null,null,null,null,"Anwesende:","Participants :","Partecipanti :"]
["ANF","test@football.ch",{"$error":"#VALUE!"},"d0002b",null,null,null,null,"SR-Nr","N° ARB","N° ARB"]
["AVF-WFV","test@football.ch",{"$error":"#VALUE!"},"d0002b",null,null,null,null,"Vorname","Prénom","Nome"]
["FTC","test@football.ch",{"$error":"#VALUE!"},"d0002b",null,null,null,null,"Nachname","Nom","Cognome"]
["FVBJ","jaussi.jonathan@football.ch",{"$error":"#VALUE!"},"c91127","Deutsch","Jonathan",null,null,"Zeitstempel","Horodatage","Timestamp"]
["FVNWS","test@football.ch",{"$error":"#VALUE!"},"c91127",null,null,null,"btn_SRScannen","SR-Ausweis scannen","Scanner la carte ARB","Scansiona la tessera ARB"]
["FVRZ","fvrz-sr@football.ch",{"$error":"#VALUE!"},"007abd","Deutsch","Susi",null,"btn_Manuell","manuelle Eingabe","Saisie manuelle","Inserimento manuale"]
["IFV","test@football.ch",{"$error":"#VALUE!"},"c91127",null,null,null,"btn_Reset","zurücksetzen","Réinitialiser","Reimposta"]
["OFV","test@football.ch",{"$error":"#VALUE!"},"007537",null,null,null,"btn_Suche","SR-Suche","Recherche ARB","Ricerca ARB"]
["SOFV","test@football.ch",{"$error":"#VALUE!"},"bf0400",null,null,null,"btn_LetzterEintrag","zum letzten Eintrag","Aller à la dernière entrée","Vai all'ultima voce"]
[null,null,null,null,null,null,null,"btn_Senden","Liste versenden","Envoyer la liste","Invia elenco"]
[null,null,null,null,null,null,null,"btn_Verband","Verbandsauswahl","Sélection de l'association","Selezione associazione"]
[null,null,null,null,null,null,null,"msg_Sprache","Sprache geändert!","Langue changée!","Lingua cambiata!"]
[null,null,null,null,null,null,null,"msg_Fehler","Sprache nicht gefunden!","Langue non trouvée!","Lingua non trovata!"]